Title,"Product Descriptions",Permalink,"Part Number",Price,"Image URL","Attachment URL","Product categories","Configurators Type","Model & Make","Product Year",Weight
"OBSOLETE - Tahoe Police Pursuit Vehicle 23"" Premium Angled Console Package","OBSOLETE[PKG,CON,VS,23TMS,10DG,HC,TAH,15-20,YU",https://www.havis.com/product/tahoe-police-pursuit-vehicle-23-premium-angled-console-package/,PKG-CON-138,0,https://www.havis.com/wp-content/uploads/2022/01/K9-A-102_P_5-04-W-4.jpg,,Discontinued,,Chevrolet>Tahoe,2015|2016|2017|2018|2019|2020,28
"Side Curtain Airbag Control Switch for 2006+ Vehicle","SW,ARBG,SD,UNV,SP,",https://www.havis.com/product/sw_arbg_sd_unv_sp-128930-0/,AOI0024,650,https://www.havis.com/wp-content/uploads/2022/01/AOI0024_P_6-16.png|https://www.havis.com/wp-content/uploads/2022/01/AOI0024.jpg|https://www.havis.com/wp-content/uploads/2022/01/AOI0024_P_6-16.jpg,,"Computing Solutions>Connectivity Accessories>Others (Cables, Harnesses, Airbag Control)|Mounting Solutions>Consoles>Console Accessories>Switches, Mic Brackets &amp; Other Accessories",,,2006|2007|2008|2009|2010|2011|2012|2013|2014|2015|2016|2017|2018|2019|2020|2021|2022,1
"DISCONTINUED - 10"" Enclosed Console","DISCONTINUED[CON,CS,UNI,10TMS,0DG,HC,W-VMT,]",https://www.havis.com/product/con_cs_uni_10tms_0dg_hc_w_vmt-19672-0/,C-1000,357.939,https://www.havis.com/wp-content/uploads/2022/01/C-1000_P_3-22-1-W_600.jpg|https://www.havis.com/wp-content/uploads/2022/01/C-1000_P_3-22_600.jpg|https://www.havis.com/wp-content/uploads/2022/01/C-1000_A_1-03-2-W_600.jpg|https://www.havis.com/wp-content/uploads/2022/01/C-1000-H_P_5-08_600.jpg|https://www.havis.com/wp-content/uploads/2022/01/C-1000_P_12-08-W_600.jpg|https://www.havis.com/wp-content/uploads/2022/01/C-1000_P_4-99_600.jpg|https://www.havis.com/wp-content/uploads/2022/01/C-1000_A_6-29-04-1_600.jpg|https://www.havis.com/wp-content/uploads/2022/01/C-1000_A_6-29-04-2_600.jpg|https://www.havis.com/wp-content/uploads/2022/01/C-1000_ISO_2-10.jpg|https://www.havis.com/wp-content/uploads/2022/01/C-1000_ISO_2-10-res.jpg|https://www.havis.com/wp-content/uploads/2022/01/C-1800_INST_6-09.jpg,https://www.havis.com/wp-content/uploads/2022/01/C-1800_INST_6-09.pdf,Discontinued,,,,5
"OBSOLETE - 12"" Enclosed console","OBSOLETE[CON,CS,UNI,12TMS,0DG,HC,W-VMT,]",https://www.havis.com/product/con_cs_uni_12tms_0dg_hc_w_vmt-19676-0/,C-1200,0,https://www.havis.com/wp-content/uploads/2022/01/C-1200_P_12-08-2-W_600-1.jpg|https://www.havis.com/wp-content/uploads/2022/01/C-1200_P_12-08-2-W_600.jpg|https://www.havis.com/wp-content/uploads/2022/01/C-1200_A_8-12-1_600.jpg|https://www.havis.com/wp-content/uploads/2022/01/C-1200_A_1-03-1_600.jpg|https://www.havis.com/wp-content/uploads/2022/01/C-1200_ISO_2-10.jpg|https://www.havis.com/wp-content/uploads/2022/01/C-1200_ISO_2-10-res.jpg,,Discontinued,,,,5
"DISCONTINUED - 14"" Enclosed Console","DISCONTINUED[CON,CS,UNI,14TMS,0DG,HC,W-VMT,]",https://www.havis.com/product/con_cs_uni_14tms_0dg_hc_w_vmt-19689-0/,C-1400,0,https://www.havis.com/wp-content/uploads/2022/01/C-1400_P_12-08-2-W_600.jpg|https://www.havis.com/wp-content/uploads/2022/01/C-1400_P_4-99_600.jpg|https://www.havis.com/wp-content/uploads/2022/01/C-1400_A_1-03-3_600.jpg|https://www.havis.com/wp-content/uploads/2022/01/C-1400_A_1-03-4_600.jpg|https://www.havis.com/wp-content/uploads/2022/01/C-1400_A_02-DUR_9-02-1_600.jpg|https://www.havis.com/wp-content/uploads/2022/01/C-1400_A_02-DUR_9-02-2_600.jpg|https://www.havis.com/wp-content/uploads/2022/01/C-1400_A_04-8-12_600.jpg|https://www.havis.com/wp-content/uploads/2022/01/C-1400_A_5-02_600.jpg|https://www.havis.com/wp-content/uploads/2022/01/C-1400_A_6-29-04-1_600.jpg|https://www.havis.com/wp-content/uploads/2022/01/C-1400_A_6-29-04-2_600.jpg|https://www.havis.com/wp-content/uploads/2022/01/C-1400_A_99-DUR_8-02_600.jpg|https://www.havis.com/wp-content/uploads/2022/01/C-1400_ISO_2-10.jpg|https://www.havis.com/wp-content/uploads/2022/01/C-1400_ISO_2-10-res.jpg,,Discontinued,,,,6
"18"" Enclosed Console","CON,CS,UNI,18TMS,0DG,HC,W-VMT,",https://www.havis.com/product/con_cs_uni_18tms_0dg_hc_w_vmt-19041-0/,C-1800,425,https://www.havis.com/wp-content/uploads/2022/01/C-1800_P_12-08-2-W_600.jpg|https://www.havis.com/wp-content/uploads/2022/01/C-1800_P_4-99_600.jpg|https://www.havis.com/wp-content/uploads/2022/01/C-1800-H_P_12-08-W_600.jpg|https://www.havis.com/wp-content/uploads/2022/01/C-1800_A_02-IMP_2-02-1_600.jpg|https://www.havis.com/wp-content/uploads/2022/01/C-1800_A_VAN_9-02_600.jpg|https://www.havis.com/wp-content/uploads/2022/01/C-1800_A_6-29-04-2_600.jpg|https://www.havis.com/wp-content/uploads/2022/01/C-1800_A_6-29-04-1_600.jpg|https://www.havis.com/wp-content/uploads/2022/01/C-1800_A_10-02_600.jpg|https://www.havis.com/wp-content/uploads/2022/01/C-1800_A_1-03-2_600.jpg|https://www.havis.com/wp-content/uploads/2022/01/C-1800_A_1-03-1_600.jpg|https://www.havis.com/wp-content/uploads/2022/01/C-1800_A_08-IMP-9-08-3_600.jpg|https://www.havis.com/wp-content/uploads/2022/01/C-1800_A_08-IMP-9-08-2_600.jpg|https://www.havis.com/wp-content/uploads/2022/01/C-1800_A_08-IMP-9-08-1_600.jpg|https://www.havis.com/wp-content/uploads/2022/01/C-1800_A_04-8-12-1_600.jpg|https://www.havis.com/wp-content/uploads/2022/01/C-1800_A_03-TAH_1-03_600.jpg|https://www.havis.com/wp-content/uploads/2022/01/C-1800_A_02-IMP_2-02-4_600.jpg|https://www.havis.com/wp-content/uploads/2022/01/C-1800_A_02-IMP_2-02-3_600.jpg|https://www.havis.com/wp-content/uploads/2022/01/C-1800_A_02-IMP_2-02-2_600.jpg|https://www.havis.com/wp-content/uploads/2022/01/C-1800_ISO_2-10.jpg|https://www.havis.com/wp-content/uploads/2022/01/C-1800_ISO_2-10-res.jpg,,"Search by Vehicle Type/Make>Dodge>Dodge Charger|Search by Vehicle Type/Make>Ford>Ford Expedition|Search by Vehicle Type/Make>Ford>Ford Explorer|Search by Vehicle Type/Make>Ford>Ford F-150|Search by Vehicle Type/Make>Ford>Ford F-250 (Ford Excursion, F-250,350,450,550, PICKUP)|Mounting Solutions>Consoles>Universal Consoles>Horizontal",,,,7
"18"" Enclosed 10"" high console","CON,CS,UNI,18TMS,0DG,HC,W-VMT,10D,",https://www.havis.com/product/con_cs_uni_18tms_0dg_hc_w_vmt_10d-34073-0/,C-1810,470,https://www.havis.com/wp-content/uploads/2022/01/C-1810_P_7-09-1-W_600.jpg|https://www.havis.com/wp-content/uploads/2022/01/C-1810_P_-_600.jpg,,"Mounting Solutions>Consoles>Universal Consoles>Horizontal",,,,9
"24"" Enclosed 10"" high console","CON,CS,UNI,24TMS,0DG,HC,W-VMT,10D,",https://www.havis.com/product/con_cs_uni_24tms_0dg_hc_w_vmt_10d-27082-0/,C-2410,513,https://www.havis.com/wp-content/uploads/2022/01/C-2410_P_3-22-1-W_600.jpg|https://www.havis.com/wp-content/uploads/2022/01/C-2410_P_3-22-2_600.jpg|https://www.havis.com/wp-content/uploads/2022/01/C-2410_P_3-22-3_600.jpg|https://www.havis.com/wp-content/uploads/2022/01/C-2410_P_8-04-W_600.jpg|https://www.havis.com/wp-content/uploads/2022/01/C-2410_A_-5-12-1_600.jpg|https://www.havis.com/wp-content/uploads/2022/01/C-2410_A_TRNST-7-14-4_600.jpg|https://www.havis.com/wp-content/uploads/2022/01/C-2410_A_TRNST-7-14-3_600.jpg|https://www.havis.com/wp-content/uploads/2022/01/C-2410_A_TRNST-7-14-2_600.jpg|https://www.havis.com/wp-content/uploads/2022/01/C-2410_A_TRNST-7-14-1_600.jpg|https://www.havis.com/wp-content/uploads/2022/01/C-2410_A_Promaster-8-14-1_600.jpg|https://www.havis.com/wp-content/uploads/2022/01/C-2410_A_9-17-1_600.jpg|https://www.havis.com/wp-content/uploads/2022/01/C-2410_A_9-10-3_600.jpg|https://www.havis.com/wp-content/uploads/2022/01/C-2410_A_9-10-1_600.jpg|https://www.havis.com/wp-content/uploads/2022/01/C-2410_A_5-17-1_600.jpg|https://www.havis.com/wp-content/uploads/2022/01/C-2410_A_1-03-1_600.jpg|https://www.havis.com/wp-content/uploads/2022/01/C-2410_A_03-TAH_1-03-2_600.jpg|https://www.havis.com/wp-content/uploads/2022/01/C-2410_A_03-TAH_1-03-1_600.jpg|https://www.havis.com/wp-content/uploads/2022/01/C-2410_ISO_2-10.jpg|https://www.havis.com/wp-content/uploads/2022/01/C-D-Series_NPR_2-10.jpg|https://www.havis.com/wp-content/uploads/2022/01/C-2410_ISO_2-10-res.jpg,https://www.havis.com/wp-content/uploads/2022/01/C-D-Series_NPR_2-10.pdf,"Mounting Solutions>Consoles>Universal Consoles>Horizontal",,,,18
"30"" Enclosed 10"" high console","CON,CS,UNI,30TMS,0DG,HC,W-VMT,10D,",https://www.havis.com/product/con_cs_uni_30tms_0dg_hc_w_vmt_10d-27352-0/,C-3010,590,https://www.havis.com/wp-content/uploads/2022/01/C-3010_P_3-22-1-W_600.jpg|https://www.havis.com/wp-content/uploads/2022/01/C-3010_P_3-22-2_600.jpg|https://www.havis.com/wp-content/uploads/2022/01/C-3010_A_1-04-W_600.jpg|https://www.havis.com/wp-content/uploads/2022/01/C-3010_A_08-EXPD-7-28-08-1_600.jpg|https://www.havis.com/wp-content/uploads/2022/01/C-3010_A_2-08-3_600.jpg|https://www.havis.com/wp-content/uploads/2022/01/C-3010_A_2-08-2_600.jpg|https://www.havis.com/wp-content/uploads/2022/01/C-3010_A_2-08-1_600.jpg|https://www.havis.com/wp-content/uploads/2022/01/C-3010_A_08-TAH-9-08-2_600.jpg|https://www.havis.com/wp-content/uploads/2022/01/C-3010_A_08-TAH-9-08-1_600.jpg|https://www.havis.com/wp-content/uploads/2022/01/C-3010_A_08-EXPD-7-28-08-2_600.jpg|https://www.havis.com/wp-content/uploads/2022/01/C-3010_ISO_2-10.jpg|https://www.havis.com/wp-content/uploads/2022/01/C-3010_ISO_2-10-res.jpg,,"Mounting Solutions>Consoles>Universal Consoles>Horizontal",,,,18
"OBSOLETE - 5"" Equipment Mounting Brackets","OBSOLETE[BRKT,L,2PC,5HX1.5W,TRKM,SP]",https://www.havis.com/product/brkt_l_2pc_5hx1_5w_trkm_sp-19453-0/,C-3061-5,0,https://www.havis.com/wp-content/uploads/2022/01/C-3061-5_P_5-08_600.jpg|https://www.havis.com/wp-content/uploads/2022/01/C-3061-5_ISO_7-06.jpg|https://www.havis.com/wp-content/uploads/2022/01/C-3061-5_ISO_7-06-res.jpg,,Discontinued,,,,2
"OBSOLETE - 7"" Equipment Mounting Brackets","OBSOLETE[BRKT,L,2PC,7HX1.5W,TRKM,SP]",https://www.havis.com/product/brkt_l_2pc_7hx1_5w_trkm_sp-19454-0/,C-3061-7,0,https://www.havis.com/wp-content/uploads/2022/01/C-3061-7_P_5-08_600.jpg,,Discontinued,,,,2
"DISCONTINUED - 9"" Equipment Mounting Brackets","DISCONTINUED[BRKT,L,2PC,9HX1.5W,TRKM,SP]",https://www.havis.com/product/brkt_l_2pc_9hx1_5w_trkm_sp-27798-0/,C-3061-9,40.89,https://www.havis.com/wp-content/uploads/2022/01/C-3061-9_P_5-08_600.jpg,,Discontinued,,,,2
"DISCONTINUED - Universal Computer Mounting Brackets, Swivel, .75"" High","DISCONTINUED[ACTADP,SWVL,0.75H,UNVMT,12GA,CRS,SP]",https://www.havis.com/product/actadp_swvl_0_75h_unvmt_12ga_crs_sp-19468-0/,C-3082-1,56.775,https://www.havis.com/wp-content/uploads/2022/01/C-3082-1_P_7-15-1-W_600.jpg|https://www.havis.com/wp-content/uploads/2022/01/C-3082-1_P_7-15-2_600.jpg|https://www.havis.com/wp-content/uploads/2022/01/C-3082-1_P_7-15-3_600.jpg|https://www.havis.com/wp-content/uploads/2022/01/C-3082-1_P_7-15-4_600.jpg|https://www.havis.com/wp-content/uploads/2022/01/C-3082-1_P_7-15-5_600.jpg|https://www.havis.com/wp-content/uploads/2022/01/C-3082-1_ISO_3-06.jpg|https://www.havis.com/wp-content/uploads/2022/01/C-3082-1_ISO_3-06-res.jpg,,Discontinued,,,,1
"DISCONTINUED - Action Adaptor, Swivel, .75"" High, Universal",DISCONTINUED[],https://www.havis.com/product/actadp_swvl_0_75h_unvmt_sp-29137-0/,C-3085-UN-1,62.46,https://www.havis.com/wp-content/uploads/2022/01/C-3085-UN-1_P_5-08-1_600.jpg|https://www.havis.com/wp-content/uploads/2022/01/C-3085-UN-1_P_5-08-2_600.jpg|https://www.havis.com/wp-content/uploads/2022/01/C-3085-UN-1_ISO_3-07.jpg|https://www.havis.com/wp-content/uploads/2022/01/C-3085-UN-1_ISO_3-07-res.jpg,,Discontinued,,,,1
"OBSOLETE - Universal Plate To Mount Troy Or Gamber Products","OBSOLETE[FXDADP,HAT,TS,OPT,12GA,CRS,SP]",https://www.havis.com/product/fxdadp_hat_ts_opt_12ga_crs_sp-19037-0/,C-3259,0,https://www.havis.com/wp-content/uploads/2022/01/C-3259_3DR_9-08_600.jpg,,Discontinued,,,,1
"Universal Keyboard Mount","DEVMT,KYBRD,UNVMT,MULTDEV,",https://www.havis.com/product/devmt_kybrd_unvmt_multdev-18711-0/,C-3329-UNV,237.627,https://www.havis.com/wp-content/uploads/2022/01/C-3329-UNV_P_5-08-1_600.jpg|https://www.havis.com/wp-content/uploads/2022/01/C-3329-UNV_P_5-08-2_600.jpg|https://www.havis.com/wp-content/uploads/2022/01/C-3329-UNV_ISO_2-10.jpg|https://www.havis.com/wp-content/uploads/2022/01/C-3329-UNV_ISO_8-07.jpg|https://www.havis.com/wp-content/uploads/2022/01/C-3329-UNV_ISO_2-10-res.jpg|https://www.havis.com/wp-content/uploads/2022/01/C-3329-UNV_ISO_8-07-res.jpg,,"Keyboards>Public Safety>Keyboard &amp; Mount Packages|Computing Solutions>Peripheral Mounts>Keyboard Mounts &amp; Bundles|Computing Solutions>Connectivity Accessories>Keyboards &amp; Bundles",,,,4
"OBSOLETE - 8"" Enclosed Console","OBSOLETE[CON,CS,UNI,8TMS,0DG,HC,W-VMT,]",https://www.havis.com/product/con_cs_uni_8tms_0dg_hc_w_vmt-19784-0/,C-800,0,https://www.havis.com/wp-content/uploads/2022/01/C-800_P_3-22-1-W_600.jpg|https://www.havis.com/wp-content/uploads/2022/01/C-800-H_P_5-08_600.jpg|https://www.havis.com/wp-content/uploads/2022/01/C-800_ISO_2-10.jpg|https://www.havis.com/wp-content/uploads/2022/01/C-800_ISO_2-10-res.jpg,,Discontinued,,,,5
"OBSOLETE - Angled Console Adapter Box","OBSOLETE[CON,ACSY,BOX,IM,9.5MS,8TMS,20DG,SP]",https://www.havis.com/product/con_acsy_box_im_9_5ms_8tms_20dg_sp-53478-0/,C-AB-820-H,0,https://www.havis.com/wp-content/uploads/2022/01/C-AB-820-H_P_1-18-1_600.jpg|https://www.havis.com/wp-content/uploads/2022/01/C-AB-820-H_P_10-26-12-2_600.jpg|https://www.havis.com/wp-content/uploads/2022/01/C-AB-820-H_P_10-26-12-3_600.jpg|https://www.havis.com/wp-content/uploads/2022/01/C-AB-820-H_P_10-26-12-6_600.jpg|https://www.havis.com/wp-content/uploads/2022/01/C-AB-820-H_P_10-26-12-5_600.jpg|https://www.havis.com/wp-content/uploads/2022/01/C-AB-820-H_P_10-26-12-4_600.jpg|https://www.havis.com/wp-content/uploads/2022/01/C-AB-820-H_ISO_11-12.jpg|https://www.havis.com/wp-content/uploads/2022/01/C-AB-820-H_MIN-MAX_ISO_3-17-1.jpg|https://www.havis.com/wp-content/uploads/2022/01/C-AB-820-H_MIN-MAX_ISO_3-17.jpg|https://www.havis.com/wp-content/uploads/2022/01/C-AB-820-H_ISO_11-12-res.jpg|https://www.havis.com/wp-content/uploads/2022/01/C-AB-820-H_MIN-MAX_ISO_3-17-res.jpg|https://www.havis.com/wp-content/uploads/2022/01/C-AB-820-H_MIN-MAX_ISO_3-17_res.jpg,,Discontinued,,,,5
"Universal Adapter Plate","FXDADP,PLT,UNVMT,MULTDEV,",https://www.havis.com/product/fxdadp_plt_unvmt_multdev-39568-0/,C-ADP-101,68,https://www.havis.com/wp-content/uploads/2022/01/C-ADP-101_P_5-22-1-W_600.jpg|https://www.havis.com/wp-content/uploads/2022/01/C-ADP-101_3DR_9-09-1_600.jpg|https://www.havis.com/wp-content/uploads/2022/01/C-ADP-101_ISO_9-09.jpg|https://www.havis.com/wp-content/uploads/2022/01/C-ADP-101_ASSY_11-09.jpg|https://www.havis.com/wp-content/uploads/2022/01/C-ADP-101_INST_9-13.jpg|https://www.havis.com/wp-content/uploads/2022/01/C-ADP-101_ISO_9-09-res.jpg,https://www.havis.com/wp-content/uploads/2022/01/C-ADP-101_ASSY_11-09.pdf|https://www.havis.com/wp-content/uploads/2022/01/C-ADP-101_INST_9-13.pdf,"Mounting Solutions>Mounting Bases>Universal",,,,3
"DISCONTINUED - Panasonic Docking Station Fixed Adaptor",DISCONTINUED[],https://www.havis.com/product/panasonic-docking-station-fixed-adaptor/,C-ADP-103,91.76,https://www.havis.com/wp-content/uploads/2022/01/C-ADP-103_P_-1_600.jpg|https://www.havis.com/wp-content/uploads/2022/01/C-ADP-103_ISO_.jpg|https://www.havis.com/wp-content/uploads/2022/01/C-ADP-103_ISO_res.jpg,,Discontinued,,,,5
"DISCONTINUED - Panasonic Docking Station Device Mount",DISCONTINUED[],https://www.havis.com/product/fxdadp_devmt_dockst_unvmt_pan_cf30-39774-0/,C-ADP-104,91.76,https://www.havis.com/wp-content/uploads/2022/01/C-ADP-104_P_-1_600.jpg|https://www.havis.com/wp-content/uploads/2022/01/C-ADP-104_ISO_.jpg|https://www.havis.com/wp-content/uploads/2022/01/C-ADP-104_ISO_res.jpg,,Discontinued,,,,4
"DISCONTINUED - Adapter Plate that allows for Mounting Laptop computer to a C-PM-101 Printer Mount Housing","DISCONTINUED[FXDADP,PLT,UNVMT,PRNTR,]",https://www.havis.com/product/c-adp-109/,C-ADP-109,62.46,https://www.havis.com/wp-content/uploads/2022/01/C-ADP-109_P_2-12-1-scaled.jpg,,Discontinued,,,,8
"C-MD-100 Series to C-UMM Bracket Assembly","FXDADP,BRKT,KIT,DEVMT,MNTR,",https://www.havis.com/product/fxdadp_brkt_kit_devmt_mntr-53543-0/,C-ADP-110,41,https://www.havis.com/wp-content/uploads/2022/01/C-ADP-110_P_1-18-1-W_600.jpg|https://www.havis.com/wp-content/uploads/2022/01/C-ADP-110_P_11-12-2_600.jpg|https://www.havis.com/wp-content/uploads/2022/01/C-ADP-110_P_11-12-8_600.jpg|https://www.havis.com/wp-content/uploads/2022/01/C-ADP-110_P_11-12-7_600.jpg|https://www.havis.com/wp-content/uploads/2022/01/C-ADP-110_P_11-12-6_600.jpg|https://www.havis.com/wp-content/uploads/2022/01/C-ADP-110_P_11-12-5_600.jpg|https://www.havis.com/wp-content/uploads/2022/01/C-ADP-110_P_11-12-4_600.jpg|https://www.havis.com/wp-content/uploads/2022/01/C-ADP-110_P_11-12-3_600.jpg|https://www.havis.com/wp-content/uploads/2022/01/C-ADP-110_P_11-12-1_600.jpg|https://www.havis.com/wp-content/uploads/2022/01/C-ADP-110_P_10-13-3_600.jpg|https://www.havis.com/wp-content/uploads/2022/01/C-ADP-110_P_10-13-2_600.jpg|https://www.havis.com/wp-content/uploads/2022/01/C-ADP-110_P_10-13-1_600.jpg|https://www.havis.com/wp-content/uploads/2022/01/C-ADP-110_P_4-14-4_600.jpg|https://www.havis.com/wp-content/uploads/2022/01/C-ADP-110_P_4-14-3_600.jpg|https://www.havis.com/wp-content/uploads/2022/01/C-ADP-110_P_4-14-2_600.jpg|https://www.havis.com/wp-content/uploads/2022/01/C-ADP-110_P_4-14-1_600.jpg|https://www.havis.com/wp-content/uploads/2022/01/C-ADP-110_P_11-12-9_600.jpg|https://www.havis.com/wp-content/uploads/2022/01/C-ADP-110_INST_12-12.jpg,https://www.havis.com/wp-content/uploads/2022/01/C-ADP-110_INST_12-12.pdf,"Mounting Solutions>Mounting Bases>Universal",,,,1
"OBSOLETE - Adapter Plate That Allows For Mounting Havis Docks or C-MD Series To GJ Inner Pole","OBSOLETE[FXDADP,BRKT,KIT,DEVMT,]",https://www.havis.com/product/fxdadp_brkt_kit_devmt-53544-0/,C-ADP-111,58.95,https://www.havis.com/wp-content/uploads/2022/01/C-ADP-111_P_-2_600.jpg|https://www.havis.com/wp-content/uploads/2022/01/C-ADP-111_P_1_600.jpg|https://www.havis.com/wp-content/uploads/2022/01/C-ADP-111_P_-3_600.jpg,,Discontinued,,,,1
"""AMPS"" to VESA devices Adapter Plate","FXDADP,BRKT,HAT,ADPTR,VESA,AMPS,",https://www.havis.com/product/fxdadp_brkt_hat_adptr_vesa_amps-54074-0/,C-ADP-112,19,https://www.havis.com/wp-content/uploads/2022/01/C-ADP-112_P_1-18-1_600.jpg|https://www.havis.com/wp-content/uploads/2022/01/C-ADP-112_P_4-13-2_600.jpg|https://www.havis.com/wp-content/uploads/2022/01/C-ADP-112_A_4-13-1_600.jpg|https://www.havis.com/wp-content/uploads/2022/01/C-ADP-112_A_4-13-2_600.jpg|https://www.havis.com/wp-content/uploads/2022/01/C-ADP-112_ISO_4-13.jpg|https://www.havis.com/wp-content/uploads/2022/01/C-ADP-112_ISO_4-13-res.jpg,,"Search by Device Brand>Zebra>Zebra TC22 &amp; TC27 Mobile Computers>Accessories|Featured Products>Zebra TC22 &amp; TC27 Mobile Computers>Accessories|Computing Solutions>Handheld &amp; Phone Docking &amp; Cradles>Zebra>Zebra TC22 &amp; TC27 Mobile Computers>Accessories|Mounting Solutions>Mounting Bases>Universal",,,,1
"Adapts docking station or other equipment with VESA 75 hole pattern to VESA 100 hole pattern","FXDADP,BRKT,UNVMT,MULTDEV,VESA,75TO100,",https://www.havis.com/product/fxdadp_brkt_unvmt_multdev_vesa_75to100-121307-0/,C-ADP-113,60,https://www.havis.com/wp-content/uploads/2022/01/C-ADP-113_P_1-18-1-W_600.jpg|https://www.havis.com/wp-content/uploads/2022/01/C-ADP-113_P_9-13-2_600.jpg|https://www.havis.com/wp-content/uploads/2022/01/C-ADP-113_P_9-13-12_600.jpg|https://www.havis.com/wp-content/uploads/2022/01/C-ADP-113_P_-2_600.jpg|https://www.havis.com/wp-content/uploads/2022/01/C-ADP-113_P_9-13-5_600.jpg|https://www.havis.com/wp-content/uploads/2022/01/C-ADP-113_P_9-13-4_600.jpg|https://www.havis.com/wp-content/uploads/2022/01/C-ADP-113_ISO_8-13.jpg|https://www.havis.com/wp-content/uploads/2022/01/C-ADP-113_ISO_8-13-res.jpg,,"Mounting Solutions>Mounting Bases>Universal",,,,1.5
"Adapter Bracket attaches to a C-HDM-304","FXDADP,BRKT,UNVMT,UMM,C-HDM-304,",https://www.havis.com/product/fxdadp_brkt_unvmt_umm_c_hdm_304-121719-0/,C-ADP-114,46,https://www.havis.com/wp-content/uploads/2022/01/C-ADP-114_P_-1_600.jpg|https://www.havis.com/wp-content/uploads/2022/01/C-ADP-114_P_2-14-2_600.jpg|https://www.havis.com/wp-content/uploads/2022/01/C-ADP-114_P_2-14-3_600.jpg|https://www.havis.com/wp-content/uploads/2022/01/C-ADP-114_P_2-14-4_600.jpg|https://www.havis.com/wp-content/uploads/2022/01/C-ADP-114_P_2-14-5_600.jpg|https://www.havis.com/wp-content/uploads/2022/01/C-ADP-114_A_2-14-3_600.jpg|https://www.havis.com/wp-content/uploads/2022/01/C-ADP-114_A_2-14-6_600.jpg|https://www.havis.com/wp-content/uploads/2022/01/C-ADP-114_A_2-14-5_600.jpg|https://www.havis.com/wp-content/uploads/2022/01/C-ADP-114_A_2-14-4_600.jpg|https://www.havis.com/wp-content/uploads/2022/01/C-ADP-114_A_2-14-7_600.jpg|https://www.havis.com/wp-content/uploads/2022/01/C-ADP-114_INST_4-14.jpg,https://www.havis.com/wp-content/uploads/2022/01/C-ADP-114_INST_4-14.pdf,"Mounting Solutions>Mounting Bases>Universal",,,,1.5
"Keyboard adaptor for Havis Keyboard Mount (C-KBM-201)","FXDADP,BRKT,DEVMT,KYBRD,",https://www.havis.com/product/fxdadp_brkt_devmt_kybrd-124522-0/,C-ADP-116,33,https://www.havis.com/wp-content/uploads/2022/01/C-ADP-116_P_2-17-1-W_600.jpg|https://www.havis.com/wp-content/uploads/2022/01/C-ADP-116_P_1-17-1-W_600.jpg|https://www.havis.com/wp-content/uploads/2022/01/C-ADP-116_P_1-17-2_600.jpg|https://www.havis.com/wp-content/uploads/2022/01/C-ADP-116_P_1-17-3_600.jpg|https://www.havis.com/wp-content/uploads/2022/01/C-ADP-116_P_2-17-1_600.jpg|https://www.havis.com/wp-content/uploads/2022/01/C-ADP-116_A_1-17-4_600.jpg|https://www.havis.com/wp-content/uploads/2022/01/C-ADP-116_A_1-17-3_600.jpg|https://www.havis.com/wp-content/uploads/2022/01/C-ADP-116_A_1-17-2_600.jpg|https://www.havis.com/wp-content/uploads/2022/01/C-ADP-116_A_1-17-1_600.jpg|https://www.havis.com/wp-content/uploads/2022/01/C-ADP-116_A_-1_600.jpg|https://www.havis.com/wp-content/uploads/2022/01/C-ADP-116_A_1-17-6_600.jpg|https://www.havis.com/wp-content/uploads/2022/01/C-ADP-116_A_1-17-5_600.jpg|https://www.havis.com/wp-content/uploads/2022/01/C-ADP-116_INST_8-16.jpg,https://www.havis.com/wp-content/uploads/2022/01/C-ADP-116_INST_8-16.pdf,"Computing Solutions>Peripheral Mounts>Keyboard Mounts &amp; Bundles|Keyboards|Computing Solutions>Connectivity Accessories>Keyboards &amp; Bundles|Mounting Solutions>Mounting Bases>Universal",,,,1
"OBSOLETE - Pedestal Mount Low","OBSOLETE[FXDADP,BRKT,KIT,DEVMT,MNTR,]",https://www.havis.com/product/fxdadp_brkt_kit_devmt_mntr-126316-0/,C-ADP-118,0,https://www.havis.com/wp-content/uploads/2022/01/C-ADP-118_P_4-17-1-W_600.jpg|https://www.havis.com/wp-content/uploads/2022/01/C-ADP-118_P_4-17-2_600.jpg|https://www.havis.com/wp-content/uploads/2022/01/C-ADP-118_P_4-17-3_600.jpg|https://www.havis.com/wp-content/uploads/2022/01/C-ADP-118_P_4-17-4_600.jpg|https://www.havis.com/wp-content/uploads/2022/01/C-ADP-118_P_4-17-5_600.jpg|https://www.havis.com/wp-content/uploads/2022/01/C-ADP-118_3DR_3-172.jpg|https://www.havis.com/wp-content/uploads/2022/01/C-ADP-118_A_2-17-1_600.jpg|https://www.havis.com/wp-content/uploads/2022/01/C-ADP-118_A_2-17-8_600.jpg|https://www.havis.com/wp-content/uploads/2022/01/C-ADP-118_A_2-17-7_600.jpg|https://www.havis.com/wp-content/uploads/2022/01/C-ADP-118_A_2-17-6_600.jpg|https://www.havis.com/wp-content/uploads/2022/01/C-ADP-118_A_2-17-5_600.jpg|https://www.havis.com/wp-content/uploads/2022/01/C-ADP-118_A_2-17-4_600.jpg|https://www.havis.com/wp-content/uploads/2022/01/C-ADP-118_A_2-17-3_600.jpg|https://www.havis.com/wp-content/uploads/2022/01/C-ADP-118_A_2-17-2_600.jpg|https://www.havis.com/wp-content/uploads/2022/01/C-ADP-118_INST_3-17.jpg|https://www.havis.com/wp-content/uploads/2022/01/C-ADP-118_3DR_3-172-res.jpg,https://www.havis.com/wp-content/uploads/2022/01/C-ADP-118_INST_3-17.pdf,Discontinued,,,,3